Target
Amyloid-beta A4 precursor protein-binding family A member 1
Ligand
BDBM71554
Substrate
Meas. Tech.
SAR analysis of small molecule inhibitors of Mint-PDZ and N-type Ca2+ channel carboxyl-terminal peptide association using HTRF - Set 2
IC50
>56800±n/a nM
Citation
 PubChem, PC SAR analysis of small molecule inhibitors of Mint-PDZ and N-type Ca2+ channel carboxyl-terminal peptide association using HTRF - Set 2 PubChem Bioassay (2010)[AID] 
Target
Name:
Amyloid-beta A4 precursor protein-binding family A member 1
Synonyms:
APBA1_RAT Mint1 neuronal munc18-1 binding protein
Type:
Enzyme Catalytic Domain
Mol. Mass.:
92603.32
Organism:
Rattus norvegicus
Description:
gi_2625023
Residue:
839
  
Inhibitor
Name:
BDBM71554
Synonyms:
2-(2-furanyl)-N-(3-hydroxypropyl)-4-quinolinecarboxamide 2-(furan-2-yl)-N-(3-hydroxypropyl)quinoline-4-carboxamide VU0410195-1 | cid_44631799
Type:
Small organic molecule
Emp. Form.:
C17H16N2O3
Mol. Mass.:
296.3205
SMILES:
OCCCNC(=O)c1cc(nc2ccccc12)-c1ccco1
: