Target
Heat shock factor protein 1
Ligand
BDBM72397
Substrate
Meas. Tech.
Luminescence Cell-Based Dose Retest to Identify Potentiators of Heat Shock Factor 1 (HSF1)
EC50
11650±n/a nM
Citation
 PubChem, PC Luminescence Cell-Based Dose Retest to Identify Potentiators of Heat Shock Factor 1 (HSF1) PubChem Bioassay (2010)[AID] 
Target
Name:
Heat shock factor protein 1
Synonyms:
HSF1_MOUSE Hsf1 protein
Type:
Enzyme Catalytic Domain
Mol. Mass.:
57208.68
Organism:
Mus musculus
Description:
P38532
Residue:
525
  
Inhibitor
Name:
BDBM72397
Synonyms:
MLS000663866 N-[3-[(E)-3-(4-fluorophenyl)acryloyl]phenyl]propionamide N-{3-[3-(4-fluorophenyl)acryloyl]phenyl}propanamide cid_5738104
Type:
Small organic molecule
Emp. Form.:
C18H16FNO2
Mol. Mass.:
297.3235
SMILES:
CCC(=O)Nc1cccc(c1)C(=O)\C=C\c1ccc(F)cc1
: