Target
Protein LANA1
Ligand
BDBM34608
Substrate
Meas. Tech.
Fluorescence Polarization Cell-Free Homogeneous Dose Retest to Confirm Inhibitors of the LANA Histone H2A/H2B Interaction
EC50
2133±n/a nM
Citation
 PubChem, PC Fluorescence Polarization Cell-Free Homogeneous Dose Retest to Confirm Inhibitors of the LANA Histone H2A/H2B Interaction PubChem Bioassay (2010)[AID] 
Target
Name:
Protein LANA1
Synonyms:
LANA LANA1_HHV8P
Type:
Enzyme Catalytic Domain
Mol. Mass.:
131093.36
Organism:
Human herpesvirus 8
Description:
Q9QR71
Residue:
1129
  
Inhibitor
Name:
BDBM34608
Synonyms:
7,8-dihydro-9H-pyrido[1,2,3-cd]perimidin-9-one SMR000021417 | cid_677487
Type:
Small organic molecule
Emp. Form.:
C14H10N2O
Mol. Mass.:
222.242
SMILES:
O=C1CCn2cnc3cccc4ccc1c2c34
: