Target
Protein LANA1
Ligand
BDBM73345
Substrate
Meas. Tech.
Fluorescence Polarization Cell-Free Homogeneous Dose Retest to Confirm Inhibitors of the LANA Histone H2A/H2B Interaction
EC50
2053±n/a nM
Citation
 PubChem, PC Fluorescence Polarization Cell-Free Homogeneous Dose Retest to Confirm Inhibitors of the LANA Histone H2A/H2B Interaction PubChem Bioassay (2010)[AID] 
Target
Name:
Protein LANA1
Synonyms:
LANA LANA1_HHV8P
Type:
Enzyme Catalytic Domain
Mol. Mass.:
131093.36
Organism:
Human herpesvirus 8
Description:
Q9QR71
Residue:
1129
  
Inhibitor
Name:
BDBM73345
Synonyms:
MLS000099054 N-(4-imidazo[2,1-b][1,3]thiazol-6-ylphenyl)ethanamide N-[4-(6-imidazo[2,1-b]thiazolyl)phenyl]acetamide cid_685797
Type:
Small organic molecule
Emp. Form.:
C13H11N3OS
Mol. Mass.:
257.311
SMILES:
CC(=O)Nc1ccc(cc1)-c1cn2ccsc2n1
: