Target
Protein LANA1
Ligand
BDBM50972
Substrate
Meas. Tech.
Fluorescence Polarization Cell-Free Homogeneous Dose Retest to Confirm Inhibitors of the LANA Histone H2A/H2B Interaction
EC50
2432±n/a nM
Citation
 PubChem, PC Fluorescence Polarization Cell-Free Homogeneous Dose Retest to Confirm Inhibitors of the LANA Histone H2A/H2B Interaction PubChem Bioassay (2010)[AID] 
Target
Name:
Protein LANA1
Synonyms:
LANA LANA1_HHV8P
Type:
Enzyme Catalytic Domain
Mol. Mass.:
131093.36
Organism:
Human herpesvirus 8
Description:
Q9QR71
Residue:
1129
  
Inhibitor
Name:
BDBM50972
Synonyms:
8-amino-3-butyl-1H-benzo[g]pteridine-2,4-dione 8-amino-3-butylbenzo[g]pteridine-2,4(1H,3H)-dione MLS000573067 cid_5599490
Type:
Small organic molecule
Emp. Form.:
C14H15N5O2
Mol. Mass.:
285.3012
SMILES:
CCCCn1c(=O)[nH]c2nc3cc(N)ccc3nc2c1=O
: