Target
Protein LANA1
Ligand
BDBM55059
Substrate
Meas. Tech.
Fluorescence Polarization Cell-Free Homogeneous Dose Retest to Confirm Inhibitors of the LANA Histone H2A/H2B Interaction
EC50
60.9±n/a nM
Citation
 PubChem, PC Fluorescence Polarization Cell-Free Homogeneous Dose Retest to Confirm Inhibitors of the LANA Histone H2A/H2B Interaction PubChem Bioassay (2010)[AID] 
Target
Name:
Protein LANA1
Synonyms:
LANA LANA1_HHV8P
Type:
Enzyme Catalytic Domain
Mol. Mass.:
131093.36
Organism:
Human herpesvirus 8
Description:
Q9QR71
Residue:
1129
  
Inhibitor
Name:
BDBM55059
Synonyms:
6-hydroxy-9-phenyl-3-xanthenone 6-hydroxy-9-phenylxanthen-3-one MLS001181924 cid_2818392
Type:
Small organic molecule
Emp. Form.:
C19H12O3
Mol. Mass.:
288.2968
SMILES:
Oc1ccc2c(-c3ccccc3)c3ccc(=O)cc3oc2c1
: