Target
Protein LANA1
Ligand
BDBM74281
Substrate
Meas. Tech.
Fluorescence Polarization Cell-Free Homogeneous Dose Retest to Confirm Inhibitors of the LANA Histone H2A/H2B Interaction
EC50
>75000±n/a nM
Citation
 PubChem, PC Fluorescence Polarization Cell-Free Homogeneous Dose Retest to Confirm Inhibitors of the LANA Histone H2A/H2B Interaction PubChem Bioassay (2010)[AID] 
Target
Name:
Protein LANA1
Synonyms:
LANA LANA1_HHV8P
Type:
Enzyme Catalytic Domain
Mol. Mass.:
131093.36
Organism:
Human herpesvirus 8
Description:
Q9QR71
Residue:
1129
  
Inhibitor
Name:
BDBM74281
Synonyms:
2-chloro-3-pyridinecarboxylic acid [2-oxo-2-[4-(1-piperidinyl)anilino]ethyl] ester MLS002156002 [2-oxidanylidene-2-[(4-piperidin-1-ylphenyl)amino]ethyl] 2-chloranylpyridine-3-carboxylate cid_2365011
Type:
Small organic molecule
Emp. Form.:
C19H20ClN3O3
Mol. Mass.:
373.833
SMILES:
Clc1ncccc1C(=O)OCC(=O)Nc1ccc(cc1)N1CCCCC1
: