Target
Protein LANA1
Ligand
BDBM74296
Substrate
Meas. Tech.
Fluorescence Polarization Cell-Free Homogeneous Dose Retest to Confirm Inhibitors of the LANA Histone H2A/H2B Interaction
EC50
>75000±n/a nM
Citation
 PubChem, PC Fluorescence Polarization Cell-Free Homogeneous Dose Retest to Confirm Inhibitors of the LANA Histone H2A/H2B Interaction PubChem Bioassay (2010)[AID] 
Target
Name:
Protein LANA1
Synonyms:
LANA LANA1_HHV8P
Type:
Enzyme Catalytic Domain
Mol. Mass.:
131093.36
Organism:
Human herpesvirus 8
Description:
Q9QR71
Residue:
1129
  
Inhibitor
Name:
BDBM74296
Synonyms:
3-(1,3-diketo-3a,4,7,7a-tetrahydroisoindol-2-yl)propionic acid [2-(3,4-diethoxyanilino)-2-keto-ethyl] ester MLS002180893 [2-(3,4-diethoxyanilino)-2-oxoethyl] 3-(1,3-dioxo-3a,4,7,7a-tetrahydroisoindol-2-yl)propanoate cid_25162354
Type:
Small organic molecule
Emp. Form.:
C23H28N2O7
Mol. Mass.:
444.4776
SMILES:
CCOc1ccc(NC(=O)COC(=O)CCN2C(=O)C3CC=CCC3C2=O)cc1OCC
: