Target
Tyrosine-protein phosphatase non-receptor type 22
Ligand
BDBM74457
Substrate
Meas. Tech.
Dose Response confirmation of uHTS hits from a small molecule inhibitors of LYP via a fluorescence intensity assay - Set 2
IC50
>79400±0 nM
Citation
 PubChem, PC Dose Response confirmation of uHTS hits from a small molecule inhibitors of LYP via a fluorescence intensity assay - Set 2 PubChem Bioassay (2010)[AID] 
Target
Name:
Tyrosine-protein phosphatase non-receptor type 22
Synonyms:
3.1.3.48 LyP Lymphoid phosphatase (Lyp) PEST-domain phosphatase PTPN22 Tyrosine-protein phosphatase non-receptor type 22 (LYP) | tyrosine-protein phosphatase non-receptor type 22 isoform 1
Type:
Mol. Mass.:
91712.31
Organism:
Homo sapiens (Human)
Description:
Q9Y2R2
Residue:
807
  
Inhibitor
Name:
BDBM74457
Synonyms:
(4-isonicotinoylpiperazino)-(4-pyridyl)methanone MLS000061046 [4-(pyridine-4-carbonyl)piperazin-1-yl]-pyridin-4-ylmethanone cid_706240 | pyridin-4-yl-(4-pyridin-4-ylcarbonylpiperazin-1-yl)methanone
Type:
Small organic molecule
Emp. Form.:
C16H16N4O2
Mol. Mass.:
296.3238
SMILES:
O=C(N1CCN(CC1)C(=O)c1ccncc1)c1ccncc1
: