Target
cAMP-dependent protein kinase catalytic subunit alpha
Ligand
BDBM2607
Substrate
histone (type Vs)
Meas. Tech.
PKA assay
IC50
11500±n/a nM
Citation
 Davis, PDHill, CHLawton, GNixon, JSWilkinson, SEHurst, SAKeech, ETurner, SE Inhibitors of protein kinase C. 1. 2,3-Bisarylmaleimides. J Med Chem 35:177-84 (1992)  
Target
Name:
cAMP-dependent protein kinase catalytic subunit alpha
Synonyms:
KAPCA_BOVIN PKC Protein Kinase C cAMP-Dependent Protein Kinase (PKA) cAMP-dependent protein kinase A cAMP-dependent protein kinase, alpha-catalytic subunit
Type:
Enzyme Complex
Mol. Mass.:
40627.77
Organism:
Bos taurus (bovine)
Description:
The PKA holoenzyme purified from bovine heart, exists as an inactive tetrameric complex, which consists of a regulatory dimer associated with two catalytic subunits. It requires cAMP to activate the enzymatic reaction.
Residue:
351
  
Inhibitor
Name:
BDBM2607
Synonyms:
3-(1,5-dimethyl-1H-indol-3-yl)-4-(1-methyl-1H-indol-3-yl)-2,5-dihydro-1H-pyrrole-2,5-dione | Bisindolylmaleimide deriv. 29
Type:
Small organic molecule
Emp. Form.:
C23H19N3O2
Mol. Mass.:
369.4159
SMILES:
Cc1ccc2n(C)cc(C3=C(C(=O)NC3=O)c3cn(C)c4ccccc34)c2c1
:
Substrate
Name:
histone (type Vs)
Synonyms:
Type:
Other Protein Type
Mol. Mass.:
358.43
Organism:
Description:
11 uM [gamma-32P]ATP as co-substrate.
Residue:
3
NA