Target
Protein kinase C beta type
Ligand
BDBM2627
Substrate
Lysine-rich histone
Meas. Tech.
PKC assay
IC50
1000±n/a nM
Citation
 Davis, PDHill, CHLawton, GNixon, JSWilkinson, SEHurst, SAKeech, ETurner, SE Inhibitors of protein kinase C. 1. 2,3-Bisarylmaleimides. J Med Chem 35:177-84 (1992)  
Target
Name:
Protein kinase C beta type
Synonyms:
KPCB_RAT Pkcb Prkcb1 Protein kinase C (PKC) | Protein kinase C beta
Type:
Enzyme Mixture
Mol. Mass.:
76755.54
Organism:
Rattus norvegicus (rat)
Description:
PKC from rat brain is known to contain predominately the conventional PKC isoforms, alpha, beta I, beta II, gamma.
Residue:
671
  
Inhibitor
Name:
BDBM2627
Synonyms:
3-(7-Amino-1-methyl-3-indolyl)-4-(1-methyl-3-indolyl)pyrrole-2,5-dione Bisindolylmaleimide deriv. 49
Type:
Small organic molecule
Emp. Form.:
C22H18N4O2
Mol. Mass.:
370.4039
SMILES:
Cn1cc(C2=C(C(=O)NC2=O)c2cn(C)c3c(N)cccc23)c2ccccc12
:
Substrate
Name:
Lysine-rich histone
Synonyms:
ING Peptide histone type IIIS
Type:
Peptide
Mol. Mass.:
10508.21
Organism:
Bos taurus (bovine)
Description:
Purified as a lysine rich fraction of histone H1 from calf thymus.
Residue:
105