Target
Importin subunit alpha-1
Ligand
BDBM29675
Substrate
Meas. Tech.
Fluorescence Cell-Free Homogeneous Counterscreen to Identify Inhibitors of the RanGTP-Importin-beta complex.
EC50
38540±n/a nM
Citation
 PubChem, PC Fluorescence Cell-Free Homogeneous Counterscreen to Identify Inhibitors of the RanGTP-Importin-beta complex. PubChem Bioassay (2010)[AID] 
Target
Name:
Importin subunit alpha-1
Synonyms:
IMA1_HUMAN RCH1 karyopherin alpha 2 (RAG cohort 1, importin alpha 1), isoform CRA_b
Type:
Enzyme Catalytic Domain
Mol. Mass.:
57852.15
Organism:
Homo sapiens (Human)
Description:
gi_119609447
Residue:
529
  
Inhibitor
Name:
BDBM29675
Synonyms:
2-methyl-N-(4-thiazolo[5,4-b]pyridin-2-ylphenyl)-1,3-benzothiazole-6-sulfonamide 2-methyl-N-[4-([1,3]thiazolo[5,4-b]pyridin-2-yl)phenyl]-1,3-benzothiazole-6-sulfonamide SMR000235790 | cid_12006124
Type:
Small organic molecule
Emp. Form.:
C20H14N4O2S3
Mol. Mass.:
438.546
SMILES:
Cc1nc2ccc(cc2s1)S(=O)(=O)Nc1ccc(cc1)-c1nc2cccnc2s1
: