Target
Importin subunit alpha-1
Ligand
BDBM75223
Substrate
Meas. Tech.
Fluorescence Cell-Free Homogeneous Counterscreen to Identify Inhibitors of the RanGTP-Importin-beta complex.
EC50
>500000±n/a nM
Citation
 PubChem, PC Fluorescence Cell-Free Homogeneous Counterscreen to Identify Inhibitors of the RanGTP-Importin-beta complex. PubChem Bioassay (2010)[AID] 
Target
Name:
Importin subunit alpha-1
Synonyms:
IMA1_HUMAN RCH1 karyopherin alpha 2 (RAG cohort 1, importin alpha 1), isoform CRA_b
Type:
Enzyme Catalytic Domain
Mol. Mass.:
57852.15
Organism:
Homo sapiens (Human)
Description:
gi_119609447
Residue:
529
  
Inhibitor
Name:
BDBM75223
Synonyms:
6-ethyl-2-[(1-oxo-2-phenylethyl)amino]-5,7-dihydro-4H-thieno[2,3-c]pyridine-3-carboxylic acid ethyl ester;hydrochloride MLS001066645 cid_24761890 ethyl 6-ethyl-2-[(2-phenylacetyl)amino]-5,7-dihydro-4H-thieno[2,3-c]pyridine-3-carboxylate;hydrochloride
Type:
Small organic molecule
Emp. Form.:
C20H24N2O3S
Mol. Mass.:
372.481
SMILES:
CCOC(=O)c1c(NC(=O)Cc2ccccc2)sc2CN(CC)CCc12
: