Target
Tyrosine-protein phosphatase non-receptor type 22
Ligand
BDBM60074
Substrate
Meas. Tech.
Dose Response confirmation of uHTS hits from a small molecule inhibitors of LYP via a fluorescence intensity assay using pCAP substrate
IC50
>79400±n/a nM
Citation
 PubChem, PC Dose Response confirmation of uHTS hits from a small molecule inhibitors of LYP via a fluorescence intensity assay using pCAP substrate PubChem Bioassay (2010)[AID] 
Target
Name:
Tyrosine-protein phosphatase non-receptor type 22
Synonyms:
3.1.3.48 LyP Lymphoid phosphatase (Lyp) PEST-domain phosphatase PTPN22 Tyrosine-protein phosphatase non-receptor type 22 (LYP) | tyrosine-protein phosphatase non-receptor type 22 isoform 1
Type:
Mol. Mass.:
91712.31
Organism:
Homo sapiens (Human)
Description:
Q9Y2R2
Residue:
807
  
Inhibitor
Name:
BDBM60074
Synonyms:
2-[(3,4-difluoroanilino)-oxomethyl]-1-cyclohexanecarboxylic acid 2-[(3,4-difluorophenyl)carbamoyl]cyclohexane-1-carboxylic acid 2-[[3,4-bis(fluoranyl)phenyl]carbamoyl]cyclohexane-1-carboxylic acid SMR000231199 | cid_4054405
Type:
Small organic molecule
Emp. Form.:
C14H15F2NO3
Mol. Mass.:
283.2706
SMILES:
OC(=O)C1CCCCC1C(=O)Nc1ccc(F)c(F)c1
: