Target
Integrin alpha-4
Ligand
BDBM75436
Substrate
Meas. Tech.
Dose Response of primary screening hit compounds for Identification of VLA-4 Allosteric Modulators
EC50
3590±n/a nM
Citation
 PubChem, PC Dose Response of primary screening hit compounds for Identification of VLA-4 Allosteric Modulators PubChem Bioassay (2010)[AID] 
Target
Name:
Integrin alpha-4
Synonyms:
CD49 antigen-like family member D CD49d antigen ITA4_HUMAN Integrin alpha-4 Integrin alpha-IV VLA-4 integrin alpha 4 precursor | integrin alpha-4 precursor
Type:
Membrane Protein
Mol. Mass.:
114897.35
Organism:
Homo sapiens (Human)
Description:
P13612
Residue:
1032
  
Inhibitor
Name:
BDBM75436
Synonyms:
(E)-3-(4-chloranyl-3-nitro-phenyl)-2-cyano-N-(3-ethoxypropyl)prop-2-enamide (E)-3-(4-chloro-3-nitrophenyl)-2-cyano-N-(3-ethoxypropyl)-2-propenamide MLS001004015 cid_2378176
Type:
Small organic molecule
Emp. Form.:
C15H16ClN3O4
Mol. Mass.:
337.758
SMILES:
CCOCCCNC(=O)C(=C\c1ccc(Cl)c(c1)[N+]([O-])=O)\C#N
: