Target
Nuclear receptor subfamily 1 group I member 2
Ligand
BDBM59652
Substrate
Meas. Tech.
Luminescence-based counterscreen for activators of the Aryl Hydrocarbon Receptor (AHR): cell-based high throughput dose response screening assay for activators of the Pregnane X Receptor (PXR)
EC50
>116135±n/a nM
Citation
 PubChem, PC Luminescence-based counterscreen for activators of the Aryl Hydrocarbon Receptor (AHR): cell-based high throughput dose response screening assay for activators of the Pregnane X Receptor (PXR) PubChem Bioassay (2010)[AID] 
Target
Name:
Nuclear receptor subfamily 1 group I member 2
Synonyms:
NR1I2 Orphan nuclear receptor PAR1 PXR SXR nuclear receptor subfamily 1 group I member 2 isoform 1
Type:
Nuclear receptor
Mol. Mass.:
49774.77
Organism:
Homo sapiens (Human)
Description:
O75469
Residue:
434
  
Inhibitor
Name:
BDBM59652
Synonyms:
5-amino-N-[3-(trifluoromethyl)phenyl]-1H-pyrazole-4-carboxamide MLS000085979 cid_1263586
Type:
Small organic molecule
Emp. Form.:
C11H9F3N4O
Mol. Mass.:
270.2106
SMILES:
Nc1[nH]ncc1C(=O)Nc1cccc(c1)C(F)(F)F
: