Target
Nuclear receptor subfamily 1 group I member 2
Ligand
BDBM51199
Substrate
Meas. Tech.
Luminescence-based counterscreen for activators of the Aryl Hydrocarbon Receptor (AHR): cell-based high throughput dose response screening assay for activators of the Pregnane X Receptor (PXR)
EC50
>116043±n/a nM
Citation
 PubChem, PC Luminescence-based counterscreen for activators of the Aryl Hydrocarbon Receptor (AHR): cell-based high throughput dose response screening assay for activators of the Pregnane X Receptor (PXR) PubChem Bioassay (2010)[AID] 
Target
Name:
Nuclear receptor subfamily 1 group I member 2
Synonyms:
NR1I2 Orphan nuclear receptor PAR1 PXR SXR nuclear receptor subfamily 1 group I member 2 isoform 1
Type:
Nuclear receptor
Mol. Mass.:
49774.77
Organism:
Homo sapiens (Human)
Description:
O75469
Residue:
434
  
Inhibitor
Name:
BDBM51199
Synonyms:
2-(6-nitro-2-phenyl-benzimidazol-1-yl)oxyacetic acid 2-(6-nitro-2-phenylbenzimidazol-1-yl)oxyacetic acid 2-[(6-nitro-2-phenyl-1H-1,3-benzimidazol-1-yl)oxy]acetic acid SMR000337780 | cid_2766807
Type:
Small organic molecule
Emp. Form.:
C15H11N3O5
Mol. Mass.:
313.2649
SMILES:
OC(=O)COn1c(nc2ccc(cc12)[N+]([O-])=O)-c1ccccc1
: