Target
Aryl hydrocarbon receptor
Ligand
BDBM46793
Substrate
Meas. Tech.
Luminescence-based cell-based high throughput dose response assay for activators of the Aryl Hydrocarbon Receptor (AHR)
EC50
>1132±n/a nM
Citation
 PubChem, PC Luminescence-based cell-based high throughput dose response assay for activators of the Aryl Hydrocarbon Receptor (AHR) PubChem Bioassay (2010)[AID] 
Target
Name:
Aryl hydrocarbon receptor
Synonyms:
AHR BHLHE76 aryl hydrocarbon receptor precursor
Type:
PROTEIN
Mol. Mass.:
96143.77
Organism:
Homo sapiens (Human)
Description:
ChEMBL_1503828
Residue:
848
  
Inhibitor
Name:
BDBM46793
Synonyms:
CHEMBL1617574 N-[3-(1,3-benzothiazol-2-yl)-6-isopropyl-5,7-dihydro-4H-thieno[2,3-c]pyridin-2-yl]acetamide;hydrochloride N-[3-(1,3-benzothiazol-2-yl)-6-propan-2-yl-5,7-dihydro-4H-thieno[2,3-c]pyridin-2-yl]ethanamide;hydrochloride cid_16195022
Type:
Small organic molecule
Emp. Form.:
C19H21N3OS2
Mol. Mass.:
371.52
SMILES:
CC(C)N1CCc2c(C1)sc(NC(C)=O)c2-c1nc2ccccc2s1
: