Target
Sphingosine 1-phosphate receptor 4
Ligand
BDBM75606
Substrate
Meas. Tech.
Late-stage fluorescence dose-response cell-based assay to identify agonists of the Sphingosine 1-Phosphate Receptor 4 (S1P4): Synthesized compounds
EC50
45.5±n/a nM
Citation
 PubChem, PC Late-stage fluorescence dose-response cell-based assay to identify agonists of the Sphingosine 1-Phosphate Receptor 4 (S1P4): Synthesized compounds PubChem Bioassay (2010)[AID] 
Target
Name:
Sphingosine 1-phosphate receptor 4
Synonyms:
EDG6 S1P receptor 4 S1P4 S1PR4_HUMAN Sphingosine 1-phosphate receptor Edg-6 sphingosine-1-phosphate 4 S1P4
Type:
G Protein-Coupled Receptor (GPCR)
Mol. Mass.:
41647.39
Organism:
Homo sapiens (Human)
Description:
Residue:
384
  
Inhibitor
Name:
BDBM75606
Synonyms:
2-chloro-3-[2-(2,4-dichlorophenoxy)ethoxy]-6-(fluoromethyl)pyridine CYM50260 SR-02000000308-1 | cid_44620894
Type:
Small organic molecule
Emp. Form.:
C14H11Cl3FNO2
Mol. Mass.:
350.6
SMILES:
FCc1ccc(OCCOc2ccc(Cl)cc2Cl)c(Cl)n1
: