Target
Intestinal-type alkaline phosphatase
Ligand
BDBM75625
Substrate
Meas. Tech.
Dose Response concentration confirmation of uHTS hits from a small molecule activators of human intestinal alkaline phosphatase via a luminescent assay
EC50
7930±n/a nM
Citation
 PubChem, PC Dose Response concentration confirmation of uHTS hits from a small molecule activators of human intestinal alkaline phosphatase via a luminescent assay PubChem Bioassay (2010)[AID] 
Target
Name:
Intestinal-type alkaline phosphatase
Synonyms:
ALPI Intestinal alkaline phosphatase | PPBI_HUMAN
Type:
PROTEIN
Mol. Mass.:
56804.94
Organism:
Homo sapiens (Human)
Description:
ChEMBL_1278525
Residue:
528
  
Inhibitor
Name:
BDBM75625
Synonyms:
MLS000582492 N-(3-methylbutyl)-4-[2-(2-methyl-[1,2,4]triazolo[1,5-c]quinazolin-5-yl)hydrazinyl]-4-oxidanylidene-butanamide N-(3-methylbutyl)-4-[2-(2-methyl[1,2,4]triazolo[1,5-c]quinazolin-5-yl)hydrazino]-4-oxobutanamide SMR000206478 | cid_12004910
Type:
Small organic molecule
Emp. Form.:
C19H25N7O2
Mol. Mass.:
383.4475
SMILES:
CC(C)CCNC(=O)CCC(=O)NNc1nc2ccccc2c2nc(C)nn12
: