Target
Intestinal-type alkaline phosphatase
Ligand
BDBM65289
Substrate
Meas. Tech.
Dose Response concentration confirmation of uHTS hits from a small molecule activators of human intestinal alkaline phosphatase via a luminescent assay
EC50
8800±n/a nM
Citation
 PubChem, PC Dose Response concentration confirmation of uHTS hits from a small molecule activators of human intestinal alkaline phosphatase via a luminescent assay PubChem Bioassay (2010)[AID] 
Target
Name:
Intestinal-type alkaline phosphatase
Synonyms:
ALPI Intestinal alkaline phosphatase | PPBI_HUMAN
Type:
PROTEIN
Mol. Mass.:
56804.94
Organism:
Homo sapiens (Human)
Description:
ChEMBL_1278525
Residue:
528
  
Inhibitor
Name:
BDBM65289
Synonyms:
(E)-N-[(salicyloylamino)thiocarbamoyl]-3-(2-thienyl)acrylamide (E)-N-[[(2-hydroxyphenyl)carbonylamino]carbamothioyl]-3-thiophen-2-yl-prop-2-enamide MLS000703259 cid_5763840
Type:
Small organic molecule
Emp. Form.:
C15H13N3O3S2
Mol. Mass.:
347.412
SMILES:
Oc1ccccc1C(=O)NNC(=S)NC(=O)\C=C\c1cccs1
: