Target
Intestinal-type alkaline phosphatase
Ligand
BDBM75640
Substrate
Meas. Tech.
Dose Response concentration confirmation of uHTS hits from a small molecule activators of human intestinal alkaline phosphatase via a luminescent assay
EC50
8060±n/a nM
Citation
 PubChem, PC Dose Response concentration confirmation of uHTS hits from a small molecule activators of human intestinal alkaline phosphatase via a luminescent assay PubChem Bioassay (2010)[AID] 
Target
Name:
Intestinal-type alkaline phosphatase
Synonyms:
ALPI Intestinal alkaline phosphatase | PPBI_HUMAN
Type:
PROTEIN
Mol. Mass.:
56804.94
Organism:
Homo sapiens (Human)
Description:
ChEMBL_1278525
Residue:
528
  
Inhibitor
Name:
BDBM75640
Synonyms:
5-(1,1-Dimethyl-propyl)-4,5,6,7-tetrahydro-1H-indazole-3-carboxylic acid [1-furan-2-yl-eth-(E)-ylidene]-hydrazide MLS000769042 N-[1-(furan-2-yl)ethylideneamino]-5-(2-methylbutan-2-yl)-4,5,6,7-tetrahydro-1H-indazole-3-carboxamide cid_3751730
Type:
Small organic molecule
Emp. Form.:
C19H26N4O2
Mol. Mass.:
342.4353
SMILES:
CCC(C)(C)C1CCc2n[nH]c(C(=O)NN=C(C)c3ccco3)c2C1
: