Target
Intestinal-type alkaline phosphatase
Ligand
BDBM61326
Substrate
Meas. Tech.
Dose Response concentration confirmation of uHTS hits from a small molecule activators of human intestinal alkaline phosphatase via a luminescent assay
EC50
7620±n/a nM
Citation
 PubChem, PC Dose Response concentration confirmation of uHTS hits from a small molecule activators of human intestinal alkaline phosphatase via a luminescent assay PubChem Bioassay (2010)[AID] 
Target
Name:
Intestinal-type alkaline phosphatase
Synonyms:
ALPI Intestinal alkaline phosphatase | PPBI_HUMAN
Type:
PROTEIN
Mol. Mass.:
56804.94
Organism:
Homo sapiens (Human)
Description:
ChEMBL_1278525
Residue:
528
  
Inhibitor
Name:
BDBM61326
Synonyms:
1-N',2-N'-bis[(E)-(2-hydroxy-4-oxocyclohexa-2,5-dien-1-ylidene)methyl]ethanedihydrazide N'~1~,N'~2~-bis(2,4-dihydroxybenzylidene)ethanedihydrazide N1',N2'-bis[(E)-(2-hydroxy-4-oxo-1-cyclohexa-2,5-dienylidene)methyl]ethanedihydrazide SMR000496526 | cid_6508451
Type:
Small organic molecule
Emp. Form.:
C16H14N4O6
Mol. Mass.:
358.3056
SMILES:
Oc1ccc(C=NNC(=O)C(=O)NN=Cc2ccc(O)cc2O)c(O)c1
: