Target
Intestinal-type alkaline phosphatase
Ligand
BDBM75654
Substrate
Meas. Tech.
Dose Response concentration confirmation of uHTS hits from a small molecule activators of human intestinal alkaline phosphatase via a luminescent assay
EC50
8250±n/a nM
Citation
 PubChem, PC Dose Response concentration confirmation of uHTS hits from a small molecule activators of human intestinal alkaline phosphatase via a luminescent assay PubChem Bioassay (2010)[AID] 
Target
Name:
Intestinal-type alkaline phosphatase
Synonyms:
ALPI Intestinal alkaline phosphatase | PPBI_HUMAN
Type:
PROTEIN
Mol. Mass.:
56804.94
Organism:
Homo sapiens (Human)
Description:
ChEMBL_1278525
Residue:
528
  
Inhibitor
Name:
BDBM75654
Synonyms:
4-Fluoro-N-[N'-(2-hydroxy-benzoyl)-hydrazinocarbothioyl]-benzamide 4-fluoro-N-[(salicyloylamino)thiocarbamoyl]benzamide 4-fluoro-N-[[[(2-hydroxyphenyl)-oxomethyl]hydrazo]-sulfanylidenemethyl]benzamide SMR000516924 | cid_1933071
Type:
Small organic molecule
Emp. Form.:
C15H12FN3O3S
Mol. Mass.:
333.337
SMILES:
Oc1ccccc1C(=O)NNC(=S)NC(=O)c1ccc(F)cc1
: