Target
Intestinal-type alkaline phosphatase
Ligand
BDBM75694
Substrate
Meas. Tech.
Dose Response concentration confirmation of uHTS hits from a small molecule activators of human intestinal alkaline phosphatase via a luminescent assay
EC50
8880±n/a nM
Citation
 PubChem, PC Dose Response concentration confirmation of uHTS hits from a small molecule activators of human intestinal alkaline phosphatase via a luminescent assay PubChem Bioassay (2010)[AID] 
Target
Name:
Intestinal-type alkaline phosphatase
Synonyms:
ALPI Intestinal alkaline phosphatase | PPBI_HUMAN
Type:
PROTEIN
Mol. Mass.:
56804.94
Organism:
Homo sapiens (Human)
Description:
ChEMBL_1278525
Residue:
528
  
Inhibitor
Name:
BDBM75694
Synonyms:
2-fluoranyl-N-[4-methylsulfanyl-1-[2-[(2-morpholin-4-yl-1,3-thiazol-4-yl)carbonyl]hydrazinyl]-1-oxidanylidene-butan-2-yl]benzenesulfonamide 2-fluoro-N-[4-(methylthio)-1-[[[2-(4-morpholinyl)-4-thiazolyl]-oxomethyl]hydrazo]-1-oxobutan-2-yl]benzenesulfonamide MLS001138490 cid_24687882
Type:
Small organic molecule
Emp. Form.:
C19H24FN5O5S3
Mol. Mass.:
517.618
SMILES:
CSCCC(NS(=O)(=O)c1ccccc1F)C(=O)NNC(=O)c1csc(n1)N1CCOCC1
: