Target
Intestinal-type alkaline phosphatase
Ligand
BDBM75700
Substrate
Meas. Tech.
Dose Response concentration confirmation of uHTS hits from a small molecule activators of human intestinal alkaline phosphatase via a luminescent assay
EC50
6370±n/a nM
Citation
 PubChem, PC Dose Response concentration confirmation of uHTS hits from a small molecule activators of human intestinal alkaline phosphatase via a luminescent assay PubChem Bioassay (2010)[AID] 
Target
Name:
Intestinal-type alkaline phosphatase
Synonyms:
ALPI Intestinal alkaline phosphatase | PPBI_HUMAN
Type:
PROTEIN
Mol. Mass.:
56804.94
Organism:
Homo sapiens (Human)
Description:
ChEMBL_1278525
Residue:
528
  
Inhibitor
Name:
BDBM75700
Synonyms:
MLS002170417 N-[3-[[(4-oxidanylidene-3H-phthalazin-1-yl)carbonylamino]carbamoyl]phenyl]ethanamide N-[3-[oxo-[[oxo-(4-oxo-3H-phthalazin-1-yl)methyl]hydrazo]methyl]phenyl]acetamide cid_9269565
Type:
Small organic molecule
Emp. Form.:
C18H15N5O4
Mol. Mass.:
365.3428
SMILES:
CC(=O)Nc1cccc(c1)C(=O)NNC(=O)c1n[nH]c(=O)c2ccccc12
: