Target
Intestinal-type alkaline phosphatase
Ligand
BDBM39629
Substrate
Meas. Tech.
Dose Response confirmation of uHTS hits from a small molecule inhibitors of human intestinal alkaline phosphatase via a luminescent assay
IC50
5180±n/a nM
Citation
 PubChem, PC Dose Response confirmation of uHTS hits from a small molecule inhibitors of human intestinal alkaline phosphatase via a luminescent assay PubChem Bioassay (2010)[AID] 
Target
Name:
Intestinal-type alkaline phosphatase
Synonyms:
ALPI Intestinal alkaline phosphatase | PPBI_HUMAN
Type:
PROTEIN
Mol. Mass.:
56804.94
Organism:
Homo sapiens (Human)
Description:
ChEMBL_1278525
Residue:
528
  
Inhibitor
Name:
BDBM39629
Synonyms:
4-[3-(3-pyridinyl)-1H-1,2,4-triazol-5-yl]-4-azatricyclo[5.2.1.0~2,6~]dec-8-ene-3,5-dione SMR000081093 | cid_2972795
Type:
Small organic molecule
Emp. Form.:
C16H13N5O2
Mol. Mass.:
307.3067
SMILES:
[H]C12CC([H])(C=C1)C1C2C(=O)N(C1=O)c1n[nH]c(n1)-c1cccnc1
: