Target
Insulin-degrading enzyme
Ligand
BDBM75787
Substrate
Meas. Tech.
Dose Response: Fluorescence polarization-based cell-based high throughput dose response assay for inhibitors of insulin-degrading enzyme (IDE)
IC50
2984±n/a nM
Citation
 PubChem, PC Dose Response: Fluorescence polarization-based cell-based high throughput dose response assay for inhibitors of insulin-degrading enzyme (IDE) PubChem Bioassay (2010)[AID] 
Target
Name:
Insulin-degrading enzyme
Synonyms:
Abeta-degrading protease IDE Insulin degrading enzyme (hIDE) Insulin-degrading enzyme Insulysin | insulin-degrading enzyme isoform 1 precursor
Type:
Enzyme Catalytic Domain
Mol. Mass.:
117968.59
Organism:
Homo sapiens (Human)
Description:
P14735
Residue:
1019
  
Inhibitor
Name:
BDBM75787
Synonyms:
3-[[4-(2-methyl-2,3-dihydroindole-1-carbonyl)phenyl]methylamino]-4-(4-methylpiperidin-1-yl)cyclobut-3-ene-1,2-dione 3-[[4-[(2-methyl-2,3-dihydroindol-1-yl)-oxomethyl]phenyl]methylamino]-4-(4-methyl-1-piperidinyl)cyclobut-3-ene-1,2-dione MLS000119688 cid_5309815
Type:
Small organic molecule
Emp. Form.:
C27H29N3O3
Mol. Mass.:
443.5375
SMILES:
CC1Cc2ccccc2N1C(=O)c1ccc(CNc2c(N3CCC(C)CC3)c(=O)c2=O)cc1
: