Target
Insulin-degrading enzyme
Ligand
BDBM75791
Substrate
Meas. Tech.
Dose Response: Fluorescence polarization-based cell-based high throughput dose response assay for inhibitors of insulin-degrading enzyme (IDE)
IC50
18800±n/a nM
Citation
 PubChem, PC Dose Response: Fluorescence polarization-based cell-based high throughput dose response assay for inhibitors of insulin-degrading enzyme (IDE) PubChem Bioassay (2010)[AID] 
Target
Name:
Insulin-degrading enzyme
Synonyms:
Abeta-degrading protease IDE Insulin degrading enzyme (hIDE) Insulin-degrading enzyme Insulysin | insulin-degrading enzyme isoform 1 precursor
Type:
Enzyme Catalytic Domain
Mol. Mass.:
117968.59
Organism:
Homo sapiens (Human)
Description:
P14735
Residue:
1019
  
Inhibitor
Name:
BDBM75791
Synonyms:
2-[3-[5-chloranyl-4-[(3,4-dimethylphenyl)amino]-6-oxidanylidene-pyridazin-1-yl]-1-adamantyl]ethanoic acid 2-[3-[5-chloro-4-(3,4-dimethylanilino)-6-oxo-1-pyridazinyl]-1-adamantyl]acetic acid MLS000521763 cid_9550272
Type:
Small organic molecule
Emp. Form.:
C24H28ClN3O3
Mol. Mass.:
441.95
SMILES:
[H]C12CC3([H])CC(CC(O)=O)(C1)CC(C2)(C3)n1ncc(Nc2ccc(C)c(C)c2)c(Cl)c1=O
: