Target
Insulin-degrading enzyme
Ligand
BDBM75848
Substrate
Meas. Tech.
Dose Response: Fluorescence polarization-based cell-based high throughput dose response assay for inhibitors of insulin-degrading enzyme (IDE)
IC50
4314±n/a nM
Citation
 PubChem, PC Dose Response: Fluorescence polarization-based cell-based high throughput dose response assay for inhibitors of insulin-degrading enzyme (IDE) PubChem Bioassay (2010)[AID] 
Target
Name:
Insulin-degrading enzyme
Synonyms:
Abeta-degrading protease IDE Insulin degrading enzyme (hIDE) Insulin-degrading enzyme Insulysin | insulin-degrading enzyme isoform 1 precursor
Type:
Enzyme Catalytic Domain
Mol. Mass.:
117968.59
Organism:
Homo sapiens (Human)
Description:
P14735
Residue:
1019
  
Inhibitor
Name:
BDBM75848
Synonyms:
MLS001157827 N-(3-imidazol-1-ylpropyl)-3-(4-methyl-2-oxidanylidene-6,7,8,9-tetrahydro-[1]benzofuro[3,2-g]chromen-3-yl)propanamide N-[3-(1-imidazolyl)propyl]-3-(4-methyl-2-oxo-6,7,8,9-tetrahydrobenzofuro[3,2-g][1]benzopyran-3-yl)propanamide cid_4869155
Type:
Small organic molecule
Emp. Form.:
C25H27N3O4
Mol. Mass.:
433.4996
SMILES:
Cc1c(CCC(=O)NCCCn2ccnc2)c(=O)oc2cc3oc4CCCCc4c3cc12
: