Target
Photoreceptor-specific nuclear receptor
Ligand
BDBM76009
Substrate
Meas. Tech.
TR-FRET-based biochemical high throughput dose response assay to identify NR2E3 inverse agonists
IC50
1457±n/a nM
Citation
 PubChem, PC TR-FRET-based biochemical high throughput dose response assay to identify NR2E3 inverse agonists PubChem Bioassay (2010)[AID] 
Target
Name:
Photoreceptor-specific nuclear receptor
Synonyms:
NR2E3 PNR photoreceptor-specific nuclear receptor
Type:
PROTEIN
Mol. Mass.:
44699.83
Organism:
Homo sapiens (Human)
Description:
ChEMBL_401901
Residue:
410
  
Inhibitor
Name:
BDBM76009
Synonyms:
3-(3,4-dimethoxyphenyl)-N-[2-[(4-fluorobenzyl)amino]-2-keto-ethyl]-4-keto-phthalazine-1-carboxamide 3-(3,4-dimethoxyphenyl)-N-[2-[(4-fluorophenyl)methylamino]-2-oxoethyl]-4-oxo-1-phthalazinecarboxamide MLS000936274 cid_22334119
Type:
Small organic molecule
Emp. Form.:
C26H23FN4O5
Mol. Mass.:
490.483
SMILES:
COc1ccc(cc1OC)-n1nc(C(=O)NCC(=O)NCc2ccc(F)cc2)c2ccccc2c1=O
: