Target
Photoreceptor-specific nuclear receptor
Ligand
BDBM76010
Substrate
Meas. Tech.
TR-FRET-based biochemical high throughput dose response assay to identify NR2E3 inverse agonists
IC50
2011±n/a nM
Citation
 PubChem, PC TR-FRET-based biochemical high throughput dose response assay to identify NR2E3 inverse agonists PubChem Bioassay (2010)[AID] 
Target
Name:
Photoreceptor-specific nuclear receptor
Synonyms:
NR2E3 PNR photoreceptor-specific nuclear receptor
Type:
PROTEIN
Mol. Mass.:
44699.83
Organism:
Homo sapiens (Human)
Description:
ChEMBL_401901
Residue:
410
  
Inhibitor
Name:
BDBM76010
Synonyms:
1-[2-(4-methoxyphenyl)-3,4-dimethyl-7-pyrazolo[3,4-d]pyridazinyl]-N-[(2-methylphenyl)methyl]-4-piperidinecarboxamide 1-[2-(4-methoxyphenyl)-3,4-dimethyl-pyrazolo[3,4-d]pyridazin-7-yl]-N-[(2-methylphenyl)methyl]piperidine-4-carboxamide MLS001116720 cid_16023006
Type:
Small organic molecule
Emp. Form.:
C28H32N6O2
Mol. Mass.:
484.5927
SMILES:
COc1ccc(cc1)-n1nc2c(nnc(C)c2c1C)N1CCC(CC1)C(=O)NCc1ccccc1C
: