Target
Apelin receptor
Ligand
BDBM269662
Substrate
Meas. Tech.
[35S]GTPgammaS Binding Assay
pH
7.5±n/a
EC50
0.150±n/a nM
Comments
extracted
Citation
 Chen, NChen, XChen, YFu, ZHeath, JAHorne, DBKaller, MRKhakoo, AYKopecky, DJMa, ZMihalic, JTSwaminath, GWang, XYeh, W Methods of treating heart failure US Patent  US10058550 Publication Date 8/28/2018 
Target
Name:
Apelin receptor
Synonyms:
AGTRL1 APJ_HUMAN Angiotensin receptor-like 1 Apelin receptor (APJ) G-protein coupled receptor HG11
Type:
Enzyme Catalytic Domain
Mol. Mass.:
42664.06
Organism:
Homo sapiens (Human)
Description:
P35414
Residue:
380
  
Inhibitor
Name:
BDBM269662
Synonyms:
(2S,3R)-N-(4-(2,6-dimethoxyphenyl)-5-(6-ethyl-2-pyridinyl)-4H-1,2,4-triazol-3-yl)-3-(5-methyl-2-pyrimidinyl)-2-butanesulfonamide US10221162, Example 176.0 | US9845310, Example 176.0
Type:
Small organic molecule
Emp. Form.:
C26H31N7O4S
Mol. Mass.:
537.634
SMILES:
CCc1cccc(n1)-c1nnc(NS(=O)(=O)[C@@H](C)[C@H](C)c2ncc(C)cn2)n1-c1c(OC)cccc1OC
: