Target
Cannabinoid receptor 2
Ligand
BDBM76082
Substrate
Meas. Tech.
SAR analysis of agonists of the Cannabinoid Receptor 2 using an Image-Based Assay - Set 3
EC50
31600±n/a nM
Citation
 PubChem, PC SAR analysis of agonists of the Cannabinoid Receptor 2 using an Image-Based Assay - Set 3 PubChem Bioassay (2010)[AID] 
Target
Name:
Cannabinoid receptor 2
Synonyms:
CANNABINOID CB2 CB2 CB2B CNR2_HUMAN Cannabinoid CB2 receptor Cannabinoid receptor 2 (CB2R) | hCB2
Type:
G Protein-Coupled Receptor (GPCR)
Mol. Mass.:
39690.94
Organism:
Homo sapiens (Human)
Description:
P34972
Residue:
360
  
Inhibitor
Name:
BDBM76082
Synonyms:
(6Z)-3-ethoxy-6-[4-(4-methoxyphenyl)-5-methyl-1,2-dihydropyrazol-3-ylidene]-1-cyclohexa-2,4-dienone (6Z)-3-ethoxy-6-[4-(4-methoxyphenyl)-5-methyl-3-pyrazolin-3-ylidene]cyclohexa-2,4-dien-1-one cid_5423853
Type:
Small organic molecule
Emp. Form.:
C19H20N2O3
Mol. Mass.:
324.3737
SMILES:
CCOc1ccc(-c2n[nH]c(C)c2-c2ccc(OC)cc2)c(O)c1
: