Target
Intestinal-type alkaline phosphatase 1
Ligand
BDBM52992
Substrate
Meas. Tech.
Dose Response concentration confirmation of uHTS hits from a small molecule activators of mouse intestinal alkaline phosphatase via a luminescent assay
EC50
9930±n/a nM
Citation
 PubChem, PC Dose Response concentration confirmation of uHTS hits from a small molecule activators of mouse intestinal alkaline phosphatase via a luminescent assay PubChem Bioassay (2010)[AID] 
Target
Name:
Intestinal-type alkaline phosphatase 1
Synonyms:
Alpi | PPBI1_RAT
Type:
Enzyme Catalytic Domain
Mol. Mass.:
58396.39
Organism:
Rattus norvegicus (Rat)
Description:
P15693
Residue:
540
  
Inhibitor
Name:
BDBM52992
Synonyms:
4,5,7,8-tetrahydroxy-1,2-naphthoquinone 4,5,7,8-tetrakis(oxidanyl)naphthalene-1,2-dione Mopain cid_75583
Type:
Small organic molecule
Emp. Form.:
C10H6O6
Mol. Mass.:
222.151
SMILES:
Oc1cc(O)c2C(=O)CC(=O)C(=O)c2c1O
: