Target
Intestinal-type alkaline phosphatase 1
Ligand
BDBM53205
Substrate
Meas. Tech.
Dose Response concentration confirmation of uHTS hits from a small molecule activators of mouse intestinal alkaline phosphatase via a luminescent assay
EC50
4960±n/a nM
Citation
 PubChem, PC Dose Response concentration confirmation of uHTS hits from a small molecule activators of mouse intestinal alkaline phosphatase via a luminescent assay PubChem Bioassay (2010)[AID] 
Target
Name:
Intestinal-type alkaline phosphatase 1
Synonyms:
Alpi | PPBI1_RAT
Type:
Enzyme Catalytic Domain
Mol. Mass.:
58396.39
Organism:
Rattus norvegicus (Rat)
Description:
P15693
Residue:
540
  
Inhibitor
Name:
BDBM53205
Synonyms:
1,3-bis[[(Z)-(3-hydroxy-4-keto-cyclohexa-2,5-dien-1-ylidene)methyl]amino]urea 1,3-bis[[(Z)-(3-hydroxy-4-oxocyclohexa-2,5-dien-1-ylidene)methyl]amino]urea MLS001202140 SMR000565039 | cid_24762014
Type:
Small organic molecule
Emp. Form.:
C15H14N4O5
Mol. Mass.:
330.2955
SMILES:
O=C(NN=CC1=CC(=O)C(=O)CC1)NN=CC1=CC(=O)C(=O)CC1
: