Target
Intestinal-type alkaline phosphatase 1
Ligand
BDBM34278
Substrate
Meas. Tech.
Dose Response confirmation of uHTS hits from a small molecule inhibitors of mouse intestinal alkaline phosphatase via a luminescent assay
IC50
1430±n/a nM
Citation
 PubChem, PC Dose Response confirmation of uHTS hits from a small molecule inhibitors of mouse intestinal alkaline phosphatase via a luminescent assay PubChem Bioassay (2010)[AID] 
Target
Name:
Intestinal-type alkaline phosphatase 1
Synonyms:
Alpi | PPBI1_RAT
Type:
Enzyme Catalytic Domain
Mol. Mass.:
58396.39
Organism:
Rattus norvegicus (Rat)
Description:
P15693
Residue:
540
  
Inhibitor
Name:
BDBM34278
Synonyms:
1-(3,4-dihydroxyphenyl)-2-[[4-ethyl-5-(2-methoxyphenyl)-1,2,4-triazol-3-yl]sulfanyl]ethanone 1-[3,4-bis(oxidanyl)phenyl]-2-[[4-ethyl-5-(2-methoxyphenyl)-1,2,4-triazol-3-yl]sulfanyl]ethanone SMR000038049 | cid_665183
Type:
Small organic molecule
Emp. Form.:
C19H19N3O4S
Mol. Mass.:
385.437
SMILES:
CCn1c(SCC(=O)c2ccc(O)c(O)c2)nnc1-c1ccccc1OC
: