Target
Intestinal-type alkaline phosphatase 1
Ligand
BDBM76221
Substrate
Meas. Tech.
Dose Response confirmation of uHTS hits from a small molecule inhibitors of mouse intestinal alkaline phosphatase via a luminescent assay
IC50
2650±n/a nM
Citation
 PubChem, PC Dose Response confirmation of uHTS hits from a small molecule inhibitors of mouse intestinal alkaline phosphatase via a luminescent assay PubChem Bioassay (2010)[AID] 
Target
Name:
Intestinal-type alkaline phosphatase 1
Synonyms:
Alpi | PPBI1_RAT
Type:
Enzyme Catalytic Domain
Mol. Mass.:
58396.39
Organism:
Rattus norvegicus (Rat)
Description:
P15693
Residue:
540
  
Inhibitor
Name:
BDBM76221
Synonyms:
MLS001096126 N-[(2-ethoxyphenyl)methyl]-3-[(2-oxidanylidene-3H-1,3-benzoxazol-6-yl)sulfonylamino]propanamide SMR000631062 | cid_24793730
Type:
Small organic molecule
Emp. Form.:
C19H21N3O6S
Mol. Mass.:
419.452
SMILES:
CCOc1ccccc1CNC(=O)CCNS(=O)(=O)c1ccc2[nH]c(=O)oc2c1
: