Target
Intestinal-type alkaline phosphatase 1
Ligand
BDBM51790
Substrate
Meas. Tech.
Dose Response confirmation of uHTS hits from a small molecule inhibitors of mouse intestinal alkaline phosphatase via a luminescent assay
IC50
2700±n/a nM
Citation
 PubChem, PC Dose Response confirmation of uHTS hits from a small molecule inhibitors of mouse intestinal alkaline phosphatase via a luminescent assay PubChem Bioassay (2010)[AID] 
Target
Name:
Intestinal-type alkaline phosphatase 1
Synonyms:
Alpi | PPBI1_RAT
Type:
Enzyme Catalytic Domain
Mol. Mass.:
58396.39
Organism:
Rattus norvegicus (Rat)
Description:
P15693
Residue:
540
  
Inhibitor
Name:
BDBM51790
Synonyms:
MLS001224314 N-[[1-[(3-fluorophenyl)methyl]-3-indolyl]methylideneamino]-3,5-dihydroxybenzamide N-[[1-[(3-fluorophenyl)methyl]indol-3-yl]methylideneamino]-3,5-dihydroxybenzamide cid_24818575
Type:
Small organic molecule
Emp. Form.:
C23H18FN3O3
Mol. Mass.:
403.4057
SMILES:
Oc1cc(O)cc(c1)C(=O)NN=Cc1cn(Cc2cccc(F)c2)c2ccccc12
: