Target
Intestinal-type alkaline phosphatase 1
Ligand
BDBM50252093
Substrate
Meas. Tech.
Dose Response confirmation of uHTS hits from a small molecule inhibitors of mouse intestinal alkaline phosphatase via a luminescent assay
IC50
2590±n/a nM
Citation
 PubChem, PC Dose Response confirmation of uHTS hits from a small molecule inhibitors of mouse intestinal alkaline phosphatase via a luminescent assay PubChem Bioassay (2010)[AID] 
Target
Name:
Intestinal-type alkaline phosphatase 1
Synonyms:
Alpi | PPBI1_RAT
Type:
Enzyme Catalytic Domain
Mol. Mass.:
58396.39
Organism:
Rattus norvegicus (Rat)
Description:
P15693
Residue:
540
  
Inhibitor
Name:
BDBM50252093
Synonyms:
6-hydroxybenzo[d][1,3]oxathiol-2-one cid_72139
Type:
Small organic molecule
Emp. Form.:
C7H4O3S
Mol. Mass.:
168.17
SMILES:
Oc1ccc2sc(=O)oc2c1
: