Target
Intestinal-type alkaline phosphatase 1
Ligand
BDBM76232
Substrate
Meas. Tech.
Dose Response confirmation of uHTS hits from a small molecule inhibitors of mouse intestinal alkaline phosphatase via a luminescent assay
IC50
5890±n/a nM
Citation
 PubChem, PC Dose Response confirmation of uHTS hits from a small molecule inhibitors of mouse intestinal alkaline phosphatase via a luminescent assay PubChem Bioassay (2010)[AID] 
Target
Name:
Intestinal-type alkaline phosphatase 1
Synonyms:
Alpi | PPBI1_RAT
Type:
Enzyme Catalytic Domain
Mol. Mass.:
58396.39
Organism:
Rattus norvegicus (Rat)
Description:
P15693
Residue:
540
  
Inhibitor
Name:
BDBM76232
Synonyms:
KI-SM SMR001231145 | cid_24978594
Type:
Small organic molecule
Emp. Form.:
C64H111N17O8S
Mol. Mass.:
1278.74
SMILES:
CC[C@H](C)[C@@H](C(=O)NCCCCCCCCCCC(=O)N1CCN(CC1)c1nc(NCCOCCOCCOCC#C)nc(n1)N1CCN(CC1)C(=O)CCCCCCCCCCNC(=O)[C@@H](CCSC)n1cc(CCO)nn1)n1cc(CCCCCN)nn1
: