Target
Intestinal-type alkaline phosphatase 1
Ligand
BDBM76250
Substrate
Meas. Tech.
Dose Response confirmation of uHTS hits from a small molecule inhibitors of mouse intestinal alkaline phosphatase via a luminescent assay
IC50
2340±n/a nM
Citation
 PubChem, PC Dose Response confirmation of uHTS hits from a small molecule inhibitors of mouse intestinal alkaline phosphatase via a luminescent assay PubChem Bioassay (2010)[AID] 
Target
Name:
Intestinal-type alkaline phosphatase 1
Synonyms:
Alpi | PPBI1_RAT
Type:
Enzyme Catalytic Domain
Mol. Mass.:
58396.39
Organism:
Rattus norvegicus (Rat)
Description:
P15693
Residue:
540
  
Inhibitor
Name:
BDBM76250
Synonyms:
2-[(4-cyclopropyl-5-pyridin-4-yl-1,2,4-triazol-3-yl)sulfanyl]-N-(3-sulfamoylphenyl)acetamide 2-[(4-cyclopropyl-5-pyridin-4-yl-1,2,4-triazol-3-yl)thio]-N-(3-sulfamoylphenyl)acetamide MLS002161098 cid_16293880
Type:
Small organic molecule
Emp. Form.:
C18H18N6O3S2
Mol. Mass.:
430.504
SMILES:
NS(=O)(=O)c1cccc(NC(=O)CSc2nnc(-c3ccncc3)n2C2CC2)c1
: