Target
Integrin alpha-4
Ligand
BDBM67060
Substrate
Meas. Tech.
SAR Confirmatory Dose Response LIBS Assay for Allosteric Ligands of the VLA-4 Integrin
EC50
26140±n/a nM
Citation
 PubChem, PC SAR Confirmatory Dose Response LIBS Assay for Allosteric Ligands of the VLA-4 Integrin PubChem Bioassay (2010)[AID] 
Target
Name:
Integrin alpha-4
Synonyms:
CD49 antigen-like family member D CD49d antigen ITA4_HUMAN Integrin alpha-4 Integrin alpha-IV VLA-4 integrin alpha 4 precursor | integrin alpha-4 precursor
Type:
Membrane Protein
Mol. Mass.:
114897.35
Organism:
Homo sapiens (Human)
Description:
P13612
Residue:
1032
  
Inhibitor
Name:
BDBM67060
Synonyms:
1-[2-[4-(2-phenyl-1-benzothiophen-3-yl)phenoxy]ethyl]pyrrolidine MLS002473624 cid_44202267
Type:
Small organic molecule
Emp. Form.:
C26H25NOS
Mol. Mass.:
399.548
SMILES:
C(CN1CCCC1)Oc1ccc(cc1)-c1c(sc2ccccc12)-c1ccccc1
: