Target
Intestinal-type alkaline phosphatase
Ligand
BDBM59281
Substrate
Meas. Tech.
Dose Response concentration confirmation of uHTS hits from a small molecule activators of human intestinal alkaline phosphatase via a luminescent assay - Set 2
EC50
7620±n/a nM
Citation
 PubChem, PC Dose Response concentration confirmation of uHTS hits from a small molecule activators of human intestinal alkaline phosphatase via a luminescent assay - Set 2 PubChem Bioassay (2010)[AID] 
Target
Name:
Intestinal-type alkaline phosphatase
Synonyms:
ALPI Intestinal alkaline phosphatase | PPBI_HUMAN
Type:
PROTEIN
Mol. Mass.:
56804.94
Organism:
Homo sapiens (Human)
Description:
ChEMBL_1278525
Residue:
528
  
Inhibitor
Name:
BDBM59281
Synonyms:
2-(2-methylpropanoylcarbamothioylamino)-N-phenyl-benzamide 2-(isobutyrylthiocarbamoylamino)-N-phenyl-benzamide 2-{[(isobutyrylamino)carbothioyl]amino}-N-phenylbenzamide SMR000160679 | cid_1792447
Type:
Small organic molecule
Emp. Form.:
C18H19N3O2S
Mol. Mass.:
341.427
SMILES:
CC(C)C(=O)NC(=S)Nc1ccccc1C(=O)Nc1ccccc1
: