Target
Intestinal-type alkaline phosphatase
Ligand
BDBM43816
Substrate
Meas. Tech.
Dose Response concentration confirmation of uHTS hits from a small molecule activators of human intestinal alkaline phosphatase via a luminescent assay - Set 2
EC50
257±n/a nM
Citation
 PubChem, PC Dose Response concentration confirmation of uHTS hits from a small molecule activators of human intestinal alkaline phosphatase via a luminescent assay - Set 2 PubChem Bioassay (2010)[AID] 
Target
Name:
Intestinal-type alkaline phosphatase
Synonyms:
ALPI Intestinal alkaline phosphatase | PPBI_HUMAN
Type:
PROTEIN
Mol. Mass.:
56804.94
Organism:
Homo sapiens (Human)
Description:
ChEMBL_1278525
Residue:
528
  
Inhibitor
Name:
BDBM43816
Synonyms:
5'-bromanylspiro[1,2-dihydro-4,1,2-benzoxadiazine-3,3'-1H-indole]-2'-one 5'-bromospiro[1,2-dihydro-4,1,2-benzoxadiazine-3,3'-1H-indole]-2'-one MLS-0258268.0001 | cid_4879298
Type:
Small organic molecule
Emp. Form.:
C14H10BrN3O2
Mol. Mass.:
332.152
SMILES:
Brc1ccc2NC(=O)C3(NNc4ccccc4O3)c2c1
: