Target
Type-1 angiotensin II receptor
Ligand
BDBM76103
Substrate
Meas. Tech.
Dose Response screen for agonists of Angiotensin II Receptor Type 1 to assess selectivity of uHTS small molecule agonists hits of the APJ receptor
EC50
>100000±n/a nM
Citation
 PubChem, PC Dose Response screen for agonists of Angiotensin II Receptor Type 1 to assess selectivity of uHTS small molecule agonists hits of the APJ receptor PubChem Bioassay (2010)[AID] 
Target
Name:
Type-1 angiotensin II receptor
Synonyms:
AGTR1 AGTR1B AT1 AT1BR AT2R1B Angiotensin II receptor Type-1 angiotensin II receptor (AT1)
Type:
Protein
Mol. Mass.:
41080.75
Organism:
Homo sapiens (Human)
Description:
P30556
Residue:
359
  
Inhibitor
Name:
BDBM76103
Synonyms:
2-({2-[2-(benzylamino)-2-oxoethyl]-3-oxo-2,3-dihydroimidazo[1,2-c]quinazolin-5-yl}thio)-N-(sec-butyl)acetamide 2-[5-[[2-(butan-2-ylamino)-2-oxoethyl]thio]-3-oxo-2H-imidazo[1,2-c]quinazolin-2-yl]-N-(phenylmethyl)acetamide N-benzyl-2-[3-keto-5-[[2-keto-2-(sec-butylamino)ethyl]thio]-2H-imidazo[1,2-c]quinazolin-2-yl]acetamide SMR000030451 | cid_3244031
Type:
Small organic molecule
Emp. Form.:
C25H27N5O3S
Mol. Mass.:
477.579
SMILES:
CCC(C)NC(=O)CSC1=Nc2ccccc2C2=NC(CC(=O)NCc3ccccc3)C(=O)N12
: