Target
Type-1 angiotensin II receptor
Ligand
BDBM76114
Substrate
Meas. Tech.
Dose Response screen for agonists of Angiotensin II Receptor Type 1 to assess selectivity of uHTS small molecule agonists hits of the APJ receptor
EC50
>100000±n/a nM
Citation
 PubChem, PC Dose Response screen for agonists of Angiotensin II Receptor Type 1 to assess selectivity of uHTS small molecule agonists hits of the APJ receptor PubChem Bioassay (2010)[AID] 
Target
Name:
Type-1 angiotensin II receptor
Synonyms:
AGTR1 AGTR1B AT1 AT1BR AT2R1B Angiotensin II receptor Type-1 angiotensin II receptor (AT1)
Type:
Protein
Mol. Mass.:
41080.75
Organism:
Homo sapiens (Human)
Description:
P30556
Residue:
359
  
Inhibitor
Name:
BDBM76114
Synonyms:
3-[3-(3,4-dihydro-1H-isoquinolin-2-yl)-3-keto-propyl]-6,7-diethoxy-2-thioxo-1H-quinazolin-4-one 3-[3-(3,4-dihydro-1H-isoquinolin-2-yl)-3-oxopropyl]-6,7-diethoxy-2-sulfanylidene-1H-quinazolin-4-one SMR000131245 | cid_4345315
Type:
Small organic molecule
Emp. Form.:
C24H27N3O4S
Mol. Mass.:
453.554
SMILES:
CCOc1cc2[nH]c(=S)n(CCC(=O)N3CCc4ccccc4C3)c(=O)c2cc1OCC
: