Target
Type-1 angiotensin II receptor
Ligand
BDBM76117
Substrate
Meas. Tech.
Dose Response screen for agonists of Angiotensin II Receptor Type 1 to assess selectivity of uHTS small molecule agonists hits of the APJ receptor
EC50
>100000±n/a nM
Citation
 PubChem, PC Dose Response screen for agonists of Angiotensin II Receptor Type 1 to assess selectivity of uHTS small molecule agonists hits of the APJ receptor PubChem Bioassay (2010)[AID] 
Target
Name:
Type-1 angiotensin II receptor
Synonyms:
AGTR1 AGTR1B AT1 AT1BR AT2R1B Angiotensin II receptor Type-1 angiotensin II receptor (AT1)
Type:
Protein
Mol. Mass.:
41080.75
Organism:
Homo sapiens (Human)
Description:
P30556
Residue:
359
  
Inhibitor
Name:
BDBM76117
Synonyms:
2-naphthalenesulfonic acid [(Z)-[amino(pyridin-4-yl)methylidene]amino] ester N'-[(2-naphthylsulfonyl)oxy]-4-pyridinecarboximidamide [(Z)-[amino(pyridin-4-yl)methylidene]amino] naphthalene-2-sulfonate cid_9551587 | naphthalene-2-sulfonic acid [(Z)-[amino(4-pyridyl)methylene]amino] ester
Type:
Small organic molecule
Emp. Form.:
C16H13N3O3S
Mol. Mass.:
327.358
SMILES:
NC(=NOS(=O)(=O)c1ccc2ccccc2c1)c1ccncc1
: