Target
Type-1 angiotensin II receptor
Ligand
BDBM57596
Substrate
Meas. Tech.
Dose Response screen for agonists of Angiotensin II Receptor Type 1 to assess selectivity of uHTS small molecule agonists hits of the APJ receptor
EC50
>100000±n/a nM
Citation
 PubChem, PC Dose Response screen for agonists of Angiotensin II Receptor Type 1 to assess selectivity of uHTS small molecule agonists hits of the APJ receptor PubChem Bioassay (2010)[AID] 
Target
Name:
Type-1 angiotensin II receptor
Synonyms:
AGTR1 AGTR1B AT1 AT1BR AT2R1B Angiotensin II receptor Type-1 angiotensin II receptor (AT1)
Type:
Protein
Mol. Mass.:
41080.75
Organism:
Homo sapiens (Human)
Description:
P30556
Residue:
359
  
Inhibitor
Name:
BDBM57596
Synonyms:
4-(3,4-dihydro-1H-isoquinolin-2-ylsulfonyl)-N'-(4,6-dimethyl-1,3-benzothiazol-2-yl)benzohydrazide SMR000235773 | cid_12006169
Type:
Small organic molecule
Emp. Form.:
C25H24N4O3S2
Mol. Mass.:
492.613
SMILES:
Cc1cc(C)c2nc(NNC(=O)c3ccc(cc3)S(=O)(=O)N3CCc4ccccc4C3)sc2c1
: