Target
Type-1 angiotensin II receptor
Ligand
BDBM63893
Substrate
Meas. Tech.
Dose Response screen for agonists of Angiotensin II Receptor Type 1 to assess selectivity of uHTS small molecule agonists hits of the APJ receptor
EC50
>100000±n/a nM
Citation
 PubChem, PC Dose Response screen for agonists of Angiotensin II Receptor Type 1 to assess selectivity of uHTS small molecule agonists hits of the APJ receptor PubChem Bioassay (2010)[AID] 
Target
Name:
Type-1 angiotensin II receptor
Synonyms:
AGTR1 AGTR1B AT1 AT1BR AT2R1B Angiotensin II receptor Type-1 angiotensin II receptor (AT1)
Type:
Protein
Mol. Mass.:
41080.75
Organism:
Homo sapiens (Human)
Description:
P30556
Residue:
359
  
Inhibitor
Name:
BDBM63893
Synonyms:
4-(tert-butyl)-N'-[(1-methyl-1H-pyrazolo[3,4-d]pyrimidin-4-yl)oxy]benzenecarboximidamide 4-tert-butyl-N''-(1-methylpyrazolo[3,4-d]pyrimidin-4-yl)oxybenzenecarboximidamide 4-tert-butyl-N'-(1-methylpyrazolo[3,4-d]pyrimidin-4-yl)oxy-benzamidine SMR000457996 | cid_2809015
Type:
Small organic molecule
Emp. Form.:
C17H20N6O
Mol. Mass.:
324.3803
SMILES:
Cn1ncc2c(ON=C(N)c3ccc(cc3)C(C)(C)C)ncnc12
: